{"text_format":"1","workbook":"xlsx","n_sheets":7,"sheets":["Instructions","Submission","Section A","Section B","Section C","SoC","Approval (Internal Use)"],"not_rendered":{"charts":0,"images":1,"macros":1,"external_links":2,"defined_names":6,"comments":1,"pivot_tables":0},"unopened":[],"bounds":{"document_bytes":16777216,"sheet_cells":100000,"rows_first":2000,"rows_last":500,"rows_between":2000,"halvings":0,"cell_chars":16384,"cell_head_chars":4096},"cells_cut":0,"cells_raw":0,"read":"whole","date_system":"1900"}

{"sheet":"Instructions","index":0,"n_rows":25,"n_cols":4,"rows_kept":25,"cut":false,"hidden":false,"merged":[[0,0,0,2]]}
["Technology Innovation and Emissions Reduction Regulation\nAggregate Facility Benchmark Units and Reference Years Request Form",null,null,"Hide for internal Python use"]
["Introduction",null,"V26.0","RFY"]
[]
[null,"This form is required for aggregate facilities seeking to change their benchmark units and/or reference years under the Technology Innovation and Emissions Reduction (TIER) Regulation.\n\nThe person responsible for an aggregate facility must submit this form to the department by the regulated deadline if they wish to request a benchmark year(s) and/or a benchmark unit(s) that differ from those previously approved.\n\nFor detailed reporting requirements, please refer to:\n- Sections 7, 15, and 23 of the TIER Regulation\n- Standard for Completing Greenhouse Gas Compliance and Forecasting Reports\n- Standard for Developing Benchmarks"]
["SGER Consolidated Form v3.0 (2012)"]
["Legal Authority"]
[]
[null,"The requirements described above are administered under the authority of the Emissions Management and Climate Resilience Act and the Technology Innovation and Emissions Reduction Regulation."]
[]
["Completion Instructions"]
[]
["1.","Enable macros and use the tabs below to navigate through the sections of this form."]
["2.","More information about certain fields can be found in the form of pop-up comments. To view comments, hover the cursor over each cell with a comment. "]
["3.","Complete all applicable sections of this form. Questions can be submitted to EPA.GHG@gov.ab.ca."]
["4.","For items that are not applicable, the N/A checkbox will be set automatically depending on the content of the associated cell(s). Enter 'N/A' in the field itself if a checkbox is not available."]
["5.","Review and check all calculations and entered values for errors."]
["6.","Ensure that the Statement of Certification (SoC) has been signed by the designated Certifying Official.  To do so, ask the Certifying Official to open the workbook and double click on the X in the signature box on the SoC tab of the workbook. Make sure this is the last step before submitting the workbook as any further modifications to the workbook will require it to be signed again. "]
["7.","Submit this form electronically as part of the submission package. See \"Submission\" tab for a summary of required submission documents."]
[]
[]
[]
["Submission Address"]
[]
[null,"Submit electronic documents to:"]
[null,"EPA.GHG@gov.ab.ca"]

{"sheet":"Submission","index":1,"n_rows":39,"n_cols":11,"rows_kept":39,"cut":false,"hidden":false,"merged":[[0,0,0,6],[29,1,30,5],[32,1,32,5],[35,1,35,5],[5,0,5,6],[28,0,28,6],[34,0,34,6],[10,0,10,6],[13,0,13,5],[12,1,12,6],[3,2,3,4],[7,3,7,4],[31,1,31,3],[40,1,40,5],[36,1,36,5],[38,1,38,5],[39,1,39,5],[37,1,37,6]]}
["Submission Information",null,null,null,null,null,null,null,"HIDE","HIDE","HIDE"]
[]
[null,null,null,null,null,null,null,null,1,"Select from the dropdown list",{"$f":"INDEX(J3:J4,I3)","v":"Select from the dropdown list"}]
["Application Type",null,"Select from the dropdown list",null,null,null,null,null,null,"Change of Benchmark Unit(s)"]
[null,null,null,null,null,null,null,null,1,"Change of Reference Year(s)",{"$f":"INDEX(J5:J10,I5)","v":"Change of Reference Year(s)"}]
["Effective Compliance Year for the Application",null,null,null,null,null,null,null,null,"Change of Benchmark Unit(s) and Reference Year(s)"]
[null,null,null,null,null,null,null,null,null,2027]
[null,"Effective compliance year:",null,null,null,null,null,null,null,2028]
[null,null,null,null,null,null,null,null,null,2029]
[null,null,null,null,null,null,null,null,null,2030]
["Unique Facility Types in the Aggregate Facility",null,null,null,null,null,null,null,1,"BT",{"$f":"INDEX(J11:J22,I11)","v":"BT"}]
[null,null,null,null,null,null,null,null,2,"GS"]
["Note: ","Please select or enter each unique facility type included in the aggregate facility in the table below.",null,null,null,null,null,null,3,"GP"]
[null,null,null,null,null,null,null,null,4,"CT"]
[null,null,"Facility Type #","Facility Type",null,null,null,null,5,"TM"]
[null,null,1,null,null,null,null,null,6,"IF"]
[null,null,2,null,null,null,null,null,11,"PL"]
[null,null,3,null,null,null,null,null,8,"MS"]
[null,null,4,null,null,null,null,null,9,"OS"]
[null,null,5,null,null,null,null,null,10,"WS"]
[null,null,6,null,null,null,null,null,11,"WP"]
[null,null,7]
[null,null,8]
[null,null,9]
[null,null,10]
[null,null,11]
[null,null,12]
[]
["Confidentiality Request"]
[null,"Are you requesting confidentiality under Section 28 of the Technology Innovation and Emissions Reduction (TIER)  Regulation for a portion of the information contained in this report?"]
[null,null,null,null,null,null,null,null,1,"Select from the dropdown list",{"$f":"INDEX(J31:J33,I31)","v":"Select from the dropdown list"}]
[null,"Select from the dropdown list",null,null,null,null,null,null,null,"Yes"]
[null,"Note: If yes, a written request with appropriate justification and supporting documentation must be submitted with this report. Confidentiality must not be requested for information that is publicly available. The department will contact you regarding your request. One confidentiality request must be submitted for each facility that is requesting confidentiality.",null,"NOTE: If yes, a written request with appropriate justification and supporting documentation must be submitted with this report. Confidentiality must not be requested for information that is publicly available. Alberta Environment will contact you regarding your request. One confidentiality request must be submitted for each facility that is requesting confidentiality.","NOTE: If yes, a written request with appropriate justification and supporting documentation must be submitted with this report. Confidentiality must not be requested for information that is publicly available. Alberta Environment will contact you regarding your request. One confidentiality request must be submitted for each facility that is requesting confidentiality.","NOTE: If yes, a written request with appropriate justification and supporting documentation must be submitted with this report. Confidentiality must not be requested for information that is publicly available. Alberta Environment will contact you regarding your request. One confidentiality request must be submitted for each facility that is requesting confidentiality.",null,null,null,"No"]
[]
["Required Submission Documents"]
["1.                                                                                                                                                                                                                                                                                                                                                                                                                                                                                                                                                            ","Aggregate Facility Benchmark Units and Reference Years Request Form (this form): The completed form must be submitted in the original file format (.XLSM) downloaded from the EPA website."]
[2,{"$f":"\"Statement of Certification: Signed by the certifying official.\"","v":"Statement of Certification: Signed by the certifying official."}]
[3,{"$f":"\"Confidentiality Request Letter: must be submitted if confidentiality is requested for any information under the TIER Regulation.\"","v":"Confidentiality Request Letter: must be submitted if confidentiality is requested for any information under the TIER Regulation."}]
[4,{"$f":"\"Additional Supporting Documents: If applicable.\"","v":"Additional Supporting Documents: If applicable."}]

{"sheet":"Section A","index":2,"n_rows":52,"n_cols":7,"rows_kept":52,"cut":false,"hidden":false,"merged":[[0,0,0,4]]}
["Section A: Administrative Information",null,null,null,null,null,"hide"]
[]
[null,"Aggregate Facility Information"]
[null,"Aggregate Facility Name"]
[]
[null,"Aggregate Facility ID"]
[]
[]
[null,"Reporting Company"]
[null,"Reporting Company Legal Name"]
[]
[]
[null,"Reporter"]
["Title",null,null,null,null,null,"Mr."]
[null,null,null,null,null,null,"Ms."]
["First Name",null,null,"Last Name",null,null,"Mrs."]
[null,null,null,null,null,null,"Miss"]
["Position/Title",null,null,"E-mail Address",null,null,"Dr."]
[]
["Telephone Number (eg. 780-123-4567 ext 8)"]
[]
["Mailing Address",null,"City/District/Municipality/County"]
[]
["Province",null,"Postal Code"]
[]
[]
[null,"Certifying Official"]
["Title"]
[]
["First Name",null,null,"Last Name"]
[]
["Position/Title",null,null,"E-mail Address"]
[]
["Telephone Number (eg. 780-123-4567 ext 8)"]
[]
["Mailing Address",null,"City/District/Municipality/County"]
[]
["Province",null,"Postal Code"]
[]
[]
[null,"Public Contact"]
["Title"]
[]
["First Name",null,null,"Last Name"]
[]
["Position/Title",null,null,"E-mail Address"]
[]
["Telephone Number (eg. 780-123-4567 ext 8)"]
[]
["Mailing Address",null,"City/District/Municipality/County"]
[]
["Province",null,"Postal Code"]

{"sheet":"Section B","index":3,"n_rows":469,"n_cols":16,"rows_kept":469,"cut":false,"hidden":false,"merged":[[6,0,6,12],[15,0,15,12],[23,0,23,12],[29,1,29,8],[9,1,9,3],[0,0,0,6],[4,0,4,12],[5,0,5,12],[17,5,21,5],[17,7,21,7],[17,9,21,9],[3,0,3,5],[44,0,44,12],[45,0,45,12],[48,1,48,3],[52,1,52,3],[54,0,54,12],[27,1,27,3],[31,1,31,3],[13,1,13,3],[42,0,42,5],[43,0,43,12],[33,0,33,12],[35,5,39,5],[35,7,39,7],[68,1,68,8],[70,1,70,3],[72,0,72,12],[74,5,78,5],[74,7,78,7],[56,5,60,5],[56,7,60,7],[56,9,60,9],[62,0,62,12],[66,1,66,3],[91,1,91,3],[93,0,93,12],[95,5,99,5],[95,7,99,7],[95,9,99,9],[81,0,81,5],[82,0,82,12],[83,0,83,12],[84,0,84,12],[87,1,87,3],[113,5,117,5],[113,7,117,7],[120,0,120,5],[121,0,121,12],[122,0,122,12],[101,0,101,12],[105,1,105,3],[107,1,107,8],[109,1,109,3],[111,0,111,12],[140,0,140,12],[144,1,144,3],[146,1,146,8],[148,1,148,3],[150,0,150,12],[123,0,123,12],[126,1,126,3],[130,1,130,3],[132,0,132,12],[134,5,138,5],[134,7,138,7],[134,9,138,9],[162,0,162,12],[165,1,165,3],[169,1,169,3],[171,0,171,12],[173,5,177,5],[173,7,177,7],[173,9,177,9],[152,5,156,5],[152,7,156,7],[159,0,159,5],[160,0,160,12],[161,0,161,12],[191,5,195,5],[191,7,195,7],[198,0,198,5],[199,0,199,12],[200,0,200,12],[179,0,179,12],[183,1,183,3],[185,1,185,8],[187,1,187,3],[189,0,189,12],[218,0,218,12],[222,1,222,3],[224,1,224,8],[226,1,226,3],[228,0,228,12],[201,0,201,12],[204,1,204,3],[208,1,208,3],[210,0,210,12],[212,5,216,5],[212,7,216,7],[212,9,216,9],[240,0,240,12],[243,1,243,3],[247,1,247,3],[249,0,249,12],[251,5,255,5],[251,7,255,7],[251,9,255,9],[230,5,234,5],[230,7,234,7],[237,0,237,5],[238,0,238,12],[239,0,239,12],[269,5,273,5],[269,7,273,7],[276,0,276,5],[277,0,277,12],[278,0,278,12],[257,0,257,12],[261,1,261,3],[263,1,263,8],[265,1,265,3],[267,0,267,12],[296,0,296,12],[300,1,300,3],[302,1,302,8],[304,1,304,3],[306,0,306,12],[279,0,279,12],[282,1,282,3],[286,1,286,3],[288,0,288,12],[290,5,294,5],[290,7,294,7],[290,9,294,9],[318,0,318,12],[321,1,321,3],[325,1,325,3],[327,0,327,12],[329,5,333,5],[329,7,333,7],[329,9,333,9],[308,5,312,5],[308,7,312,7],[315,0,315,5],[316,0,316,12],[317,0,317,12],[347,5,351,5],[347,7,351,7],[354,0,354,5],[355,0,355,12],[356,0,356,12],[335,0,335,12],[339,1,339,3],[341,1,341,8],[343,1,343,3],[345,0,345,12],[374,0,374,12],[378,1,378,3],[380,1,380,8],[382,1,382,3],[384,0,384,12],[357,0,357,12],[360,1,360,3],[364,1,364,3],[366,0,366,12],[368,5,372,5],[368,7,372,7],[368,9,372,9],[396,0,396,12],[399,1,399,3],[403,1,403,3],[405,0,405,12],[407,5,411,5],[407,7,411,7],[407,9,411,9],[386,5,390,5],[386,7,390,7],[393,0,393,5],[394,0,394,12],[395,0,395,12],[425,5,429,5],[425,7,429,7],[432,0,432,5],[433,0,433,12],[434,0,434,12],[413,0,413,12],[417,1,417,3],[419,1,419,8],[421,1,421,3],[423,0,423,12],[464,5,468,5],[464,7,468,7],[452,0,452,12],[456,1,456,3],[458,1,458,8],[460,1,460,3],[462,0,462,12],[435,0,435,12],[438,1,438,3],[442,1,442,3],[444,0,444,12],[446,5,450,5],[446,7,450,7],[446,9,450,9]]}
["Section B: Benchmark Unit and Reference Year Information",null,null,null,null,null,null,null,null,null,null,null,null,"hide","HIDE","HIDE"]
["Note: A benchmark unit and reference year information table will be displayed for each unique facility type listed in the Submission tab."]
[]
["Correlation Information for the Facility Type:",null,null,null,null,null,{"$f":"IF(Submission!D16=\"\",\"N/A\",Submission!D16)","v":"N/A"},null,null,null,null,null,null,"TABLE 1"]
[]
["Correlation information for the pre-existing benchmark unit and reference year(s)"]
[]
[null,"Select the pre-existing approved or default benchmark unit from the dropdown list below. "]
[]
[null,"Select from the dropdown list"]
[]
[null,"If \"Other benchmark unit\" is selected above, enter the benchmark unit in the cell below."]
[]
[]
[]
["Enter the correlation analysis results in the table below using the pre-existing benchmark unit and reference years for the facility type identified above.",null,null,null,null,null,null,null,null,null,null,null,null,null,"Select from the dropdown list",{"$f":"INDEX(O16:O20,N16)","v":"Select from the dropdown list"}]
[null,null,null,null,null,null,null,null,null,null,null,null,null,null,"Production","Production"]
[null,null,"Year",null,"Production Accounting to TRE Correlation (rAgg)",null,"Production Accounting to SFC Correlation (rAgg _SFC)",null,"Production Accounting to Flaring Correlation (rAgg_F)",null,null,null,null,null,"Receipts","Receipts"]
[null,null,null,null,null,null,null,null,null,null,null,null,null,null,"Disposition","Disposition"]
[null,null,null,null,null,null,null,null,null,null,null,null,null,null,"Other benchmark unit","Other benchmark unit"]
[]
[null,null,"All Years Combined"]
[]
["Correlation information for the requested benchmark unit and reference year(s)"]
["Note: Use the pre-existing benchmark unit or reference year(s) if either the benchmark unit or the reference year(s) remain unchanged."]
[null,"Select the requested benchmark unit from the dropdown list below. "]
[]
[null,"Select from the dropdown list"]
[]
[null,"If \"Other benchmark unit\" is selected above, enter the benchmark unit in the cell below."]
[]
[]
[]
["Enter the correlation analysis results in the table below using the requested benchmark unit and reference years for the facility type identified above."]
[]
[null,null,"Year",null,"Production Accounting to TRE Correlation (rAgg)",null,"Production Accounting to SFC Correlation (rAgg _SFC)",null,"Production Accounting to Flaring Correlation (rAgg_F)"]
[]
[]
[]
[null,null,"All Years Combined"]
[]
[]
["Correlation Information for the Facility Type:",null,null,null,null,null,{"$f":"IF(Submission!D17=\"\",\"N/A\",Submission!D17)","v":"N/A"},null,null,null,null,null,null,"table 2"]
[]
["Correlation information for the pre-existing benchmark unit and reference year(s)"]
[]
[null,"Select the pre-existing approved or default benchmark unit from the dropdown list below. "]
[]
[null,"Select from the dropdown list"]
[]
[null,"If \"Other benchmark unit\" is selected above, enter the benchmark unit in the cell below."]
[]
[]
[]
["Enter the correlation analysis results in the table below using the pre-existing benchmark unit and reference years for the facility type identified above."]
[]
[null,null,"Year",null,"Production Accounting to TRE Correlation (rAgg)",null,"Production Accounting to SFC Correlation (rAgg _SFC)",null,"Production Accounting to Flaring Correlation (rAgg_F)"]
[null,null,{"$f":"$C$19","v":0}]
[null,null,{"$f":"$C$20","v":0}]
[null,null,{"$f":"$C$21","v":0}]
{"$rows_left_out":410}
{"sheet":"Section C","index":4,"n_rows":8,"n_cols":2,"rows_kept":8,"cut":false,"hidden":false,"merged":[[7,1,109,7],[2,1,2,7],[3,1,3,7],[4,1,4,7],[5,1,5,7],[6,1,6,7]]}
[null,"Section C: Justification for the Requested Change(s)"]
[null,"1. Complete this section if you are requesting a change to the previously approved or default benchmark unit(s), reference year(s) or both."]
[null,"2. As per section 7 (6) of the TIER regulation, please provide a clear rationale for the requested change(s), along with relevant supporting documentation. "]
[null,"3. Submit any supporting evidence for the proposed change(s), including production trend analysis, emissions correlation analysis, and any associated plots, drawings, or explanatory notes. "]
[null,"4. If you are submitting attachments with this document, please list them in the space provided below."]
[null,"5. You may use the space below (press Alt + Enter to insert a line break for additional details)"]
[]
[null,"\n\n\n"]

{"sheet":"SoC","index":5,"n_rows":39,"n_cols":6,"rows_kept":39,"cut":false,"hidden":false,"merged":[[39,1,39,5],[32,1,33,3],[28,1,29,5],[0,1,0,6],[1,1,1,6],[2,1,2,6],[27,2,27,5],[10,1,10,3],[31,1,31,3]]}
[]
[null,"Statement of Certification"]
[]
[null,"Associated TIER Regulation Submission"]
[]
[null,"Aggregate Facility ID",null,"Application Effective Compliance Year"]
[null,{"$f":"'Section A'!B7","v":0},null,{"$f":"Submission!D8","v":0}]
[]
[null,"Aggregate Facility Name",null,"Application Type",null,"Requested Reference Years"]
[null,{"$f":"'Section A'!B5","v":0},null,{"$f":"IF(Submission!C4=\"Select from the dropdown list\",\"\",Submission!C4)","v":""},null,{"$f":"'Section B'!C37&\" \"&'Section B'!C38&\" \"&'Section B'!C39","v":"  "}]
[]
[null,"Facility Type",null,"Requested Benchmark Unit"]
[null,{"$f":"IF(Submission!D16=\"\",\"\",Submission!D16)","v":""},null,{"$f":"IF('Section B'!B28=\"Select from the dropdown list\",\"\",IF('Section B'!B28=\"Other benchmark unit\",'Section B'!B32,'Section B'!B28))","v":""}]
[null,{"$f":"IF(Submission!D17=\"\",\"\",Submission!D17)","v":""},null,{"$f":"IF('Section B'!B67=\"Select from the dropdown list\",\"\",IF('Section B'!B67=\"Other benchmark unit\",'Section B'!B71,'Section B'!B67))","v":""}]
[null,{"$f":"IF(Submission!D18=\"\",\"\",Submission!D18)","v":""},null,{"$f":"IF('Section B'!B106=\"Select from the dropdown list\",\"\",IF('Section B'!B106=\"Other benchmark unit\",'Section B'!B110,'Section B'!B106))","v":""}]
[null,{"$f":"IF(Submission!D19=\"\",\"\",Submission!D19)","v":""},null,{"$f":"IF('Section B'!B145=\"Select from the dropdown list\",\"\",IF('Section B'!B145=\"Other benchmark unit\",'Section B'!B149,'Section B'!B145))","v":""}]
[null,{"$f":"IF(Submission!D20=\"\",\"\",Submission!D20)","v":""},null,{"$f":"IF('Section B'!B184=\"Select from the dropdown list\",\"\",IF('Section B'!B184=\"Other benchmark unit\",'Section B'!B188,'Section B'!B184))","v":""}]
[null,{"$f":"IF(Submission!D21=\"\",\"\",Submission!D21)","v":""},null,{"$f":"IF('Section B'!B223=\"Select from the dropdown list\",\"\",IF('Section B'!B223=\"Other benchmark unit\",'Section B'!B227,'Section B'!B223))","v":""}]
[null,{"$f":"IF(Submission!D22=\"\",\"\",Submission!D22)","v":""},null,{"$f":"IF('Section B'!B262=\"Select from the dropdown list\",\"\",IF('Section B'!B262=\"Other benchmark unit\",'Section B'!B266,'Section B'!B262))","v":""}]
[null,{"$f":"IF(Submission!D23=\"\",\"\",Submission!D23)","v":""},null,{"$f":"IF('Section B'!B301=\"Select from the dropdown list\",\"\",IF('Section B'!B301=\"Other benchmark unit\",'Section B'!B305,'Section B'!B301))","v":""}]
[null,{"$f":"IF(Submission!D24=\"\",\"\",Submission!D24)","v":""},null,{"$f":"IF('Section B'!B340=\"Select from the dropdown list\",\"\",IF('Section B'!B340=\"Other benchmark unit\",'Section B'!B344,'Section B'!B340))","v":""}]
[null,{"$f":"IF(Submission!D25=\"\",\"\",Submission!D25)","v":""},null,{"$f":"IF('Section B'!B379=\"Select from the dropdown list\",\"\",IF('Section B'!B379=\"Other benchmark unit\",'Section B'!B383,'Section B'!B379))","v":""}]
[null,{"$f":"IF(Submission!D26=\"\",\"\",Submission!D26)","v":""},null,{"$f":"IF('Section B'!B418=\"Select from the dropdown list\",\"\",IF('Section B'!B418=\"Other benchmark unit\",'Section B'!B422,'Section B'!B418))","v":""}]
[null,{"$f":"IF(Submission!D27=\"\",\"\",Submission!D27)","v":""},null,{"$f":"IF('Section B'!B457=\"Select from the dropdown list\",\"\",IF('Section B'!B457=\"Other benchmark unit\",'Section B'!B461,'Section B'!B457))","v":""}]
[]
[null,"Signature of Certifying Official"]
[null,"   I, "]
[null,{"$f":"'Section A'!B31&\" \"&'Section A'!D31","v":" "},"(Certifying Official),"]
[null,"having the authority to bind the reporting company, hereby, certify that I have reviewed the information being submitted, that I have exercised due diligence to ensure that the information is true and complete. I understand and commit to adhere to the regulatory requirements which may result from acceptance of this request."]
[]
[]
[null,"Signature of Certifying Official (Double click on the X to sign)                                                                                             Date (YYYY-MM-DD)",null,null,null,"Date"]
[]
[]
[]
[null,"First Name",null,"Last Name"]
[null,{"$f":"'Section A'!B17","v":0},null,{"$f":"'Section A'!D17","v":0}]
[null,"Position/Title",null,"E-mail Address",null,"Phone Number"]
[null,{"$f":"'Section A'!B19","v":0},null,{"$f":"'Section A'!D19","v":0},null,{"$f":"'Section A'!B21","v":0}]

{"sheet":"Approval (Internal Use)","index":6,"n_rows":55,"n_cols":6,"rows_kept":55,"cut":false,"hidden":true,"merged":[[0,1,0,6],[1,1,1,6],[2,1,2,6],[10,1,10,3],[27,1,37,5],[48,1,48,3],[49,1,50,3],[56,1,56,5],[45,1,45,5],[46,1,46,5],[49,5,50,5]]}
[]
[null,"Approval for Changes to Benchmark Unit(s) and/or Reference Year(s)"]
[]
[null,"Associated TIER Regulation Submission"]
[]
[null,"Aggregate Facility ID",null,"Application Efffective Compliance Year"]
[null,{"$f":"'Section A'!B7","v":0},null,{"$f":"Submission!D8","v":0}]
[]
[null,"Aggregate Facility Name",null,"Application Type",null,"Requested Reference Years"]
[null,{"$f":"'Section A'!B5","v":0},null,{"$f":"IF(Submission!C4=\"Select from the dropdown list\",\"\",Submission!C4)","v":""},null,{"$f":"'Section B'!C37&\" \"&'Section B'!C38&\" \"&'Section B'!C39","v":"  "}]
[]
[null,"Facility Type",null,"Requested Benchmark Unit"]
[null,{"$f":"IF(Submission!D16=\"\",\"\",Submission!D16)","v":""},null,{"$f":"IF('Section B'!B28=\"Select from the dropdown list\",\"\",IF('Section B'!B28=\"Other benchmark unit\",'Section B'!B32,'Section B'!B28))","v":""}]
[null,{"$f":"IF(Submission!D17=\"\",\"\",Submission!D17)","v":""},null,{"$f":"IF('Section B'!B67=\"Select from the dropdown list\",\"\",IF('Section B'!B67=\"Other benchmark unit\",'Section B'!B71,'Section B'!B67))","v":""}]
[null,{"$f":"IF(Submission!D18=\"\",\"\",Submission!D18)","v":""},null,{"$f":"IF('Section B'!B106=\"Select from the dropdown list\",\"\",IF('Section B'!B106=\"Other benchmark unit\",'Section B'!B110,'Section B'!B106))","v":""}]
[null,{"$f":"IF(Submission!D19=\"\",\"\",Submission!D19)","v":""},null,{"$f":"IF('Section B'!B145=\"Select from the dropdown list\",\"\",IF('Section B'!B145=\"Other benchmark unit\",'Section B'!B149,'Section B'!B145))","v":""}]
[null,{"$f":"IF(Submission!D20=\"\",\"\",Submission!D20)","v":""},null,{"$f":"IF('Section B'!B184=\"Select from the dropdown list\",\"\",IF('Section B'!B184=\"Other benchmark unit\",'Section B'!B188,'Section B'!B184))","v":""}]
[null,{"$f":"IF(Submission!D21=\"\",\"\",Submission!D21)","v":""},null,{"$f":"IF('Section B'!B223=\"Select from the dropdown list\",\"\",IF('Section B'!B223=\"Other benchmark unit\",'Section B'!B227,'Section B'!B223))","v":""}]
[null,{"$f":"IF(Submission!D22=\"\",\"\",Submission!D22)","v":""},null,{"$f":"IF('Section B'!B262=\"Select from the dropdown list\",\"\",IF('Section B'!B262=\"Other benchmark unit\",'Section B'!B266,'Section B'!B262))","v":""}]
[null,{"$f":"IF(Submission!D23=\"\",\"\",Submission!D23)","v":""},null,{"$f":"IF('Section B'!B301=\"Select from the dropdown list\",\"\",IF('Section B'!B301=\"Other benchmark unit\",'Section B'!B305,'Section B'!B301))","v":""}]
[null,{"$f":"IF(Submission!D24=\"\",\"\",Submission!D24)","v":""},null,{"$f":"IF('Section B'!B340=\"Select from the dropdown list\",\"\",IF('Section B'!B340=\"Other benchmark unit\",'Section B'!B344,'Section B'!B340))","v":""}]
[null,{"$f":"IF(Submission!D25=\"\",\"\",Submission!D25)","v":""},null,{"$f":"IF('Section B'!B379=\"Select from the dropdown list\",\"\",IF('Section B'!B379=\"Other benchmark unit\",'Section B'!B383,'Section B'!B379))","v":""}]
[null,{"$f":"IF(Submission!D26=\"\",\"\",Submission!D26)","v":""},null,{"$f":"IF('Section B'!B418=\"Select from the dropdown list\",\"\",IF('Section B'!B418=\"Other benchmark unit\",'Section B'!B422,'Section B'!B418))","v":""}]
[null,{"$f":"IF(Submission!D27=\"\",\"\",Submission!D27)","v":""},null,{"$f":"IF('Section B'!B457=\"Select from the dropdown list\",\"\",IF('Section B'!B457=\"Other benchmark unit\",'Section B'!B461,'Section B'!B457))","v":""}]
[]
[null,"Reviewer's Comments and Recommendation"]
[]
[]
[]
[]
[]
[]
[]
[]
[]
[]
[]
[]
[]
[null,"Reviewer",null,null,null,"Date"]
[]
[]
[null,"Director's Approval"]
[]
[]
[]
[]
[]
[null,"Director's Signature",null,null,null,"Date"]
[]
[]
[]
[null,"First Name",null,"Last Name"]
[]
[null,"Position/Title",null,"E-mail Address"]